folio,fuente,interv,sesiones,sexo,edad,edociv,escol,entidad,instituc,profesion,sitCOVID,AtenCOVID,TRIAGE,Motivo,ImprDX,Comorb,AtRiesgoSui,CGIgrav,Tec1ses1,Tec2ses1,Tec3ses1,DistInicSes1,DistFinSes1,Tec1ses2,Tec2ses2,Tec3ses2,Tec4ses2,Tec5ses2,DistInicSes2,DistFinSes2,Tec1ses3,Tec2ses3,Tec3ses3,Tec4ses3,DistInicses3,DistrFinses3,Tec1ses4,Tec2ses4,Tec3ses4,DistInicses4,DistFinses4,Tec1ses5,Tec2ses5,Tec3ses5,DistInises5,DistFinses5,Tec1ses6,Tec2ses6,DistInises6,DistFinlses6,Tec1ses7,Tec2ses7,Distinicses7,DistFinses7,Tec1ses8,Tec2ses8,DistInicses8,DistFinses8,Tec1ses9,Tec2ses9,DistInicses9,DistFinses9,Tec1ses10,Tec2ses10,DistInicses10,DistFinlses10,Tec1ses11,Tec2ses11,DistInicses11,DistFinses11,Tec1Ses12,Tec2ses12,DistInicses12,DistFinses12,PacSatif,PacTecUTIL,PacRecom,PacComplej,PacTecFACIL,PacTecDIF,PacSatRemoto,ClinContenido,ClinComplej,ClinRemoto,ClinIdoneidad,ClinSuger,CGImejoria
RSIC03IA,1.0,1.0,1.0,2.0,39.0,1.0,5.0,3.0,3.0,5.0,1.0,1.0,2.0,,1.0,1.0,2.0,,1.0,,,,,,,,,,,,,,,,,,,,,,,,,,,,,,,,,,,,,,,,,,,,,,,,,,,,,,,,,,,,,,,,,,,,
RSICIADM,1.0,1.0,3.0,2.0,28.0,1.0,5.0,3.0,2.0,2.0,4.0,0.0,2.0,,3.0,0.0,1.0,,1.0,,,,,2.0,,,,,,,3.0,,,,,,,,,,,,,,,,,,,,,,,,,,,,,,,,,,,,,,,,,,,,,,,,,,,,,,,,
RSICIADM,1.0,1.0,2.0,2.0,34.0,1.0,6.0,3.0,3.0,4.0,1.0,1.0,1.0,,2.0,0.0,1.0,,1.0,,,,,4.0,,,,,,,,,,,,,,,,,,,,,,,,,,,,,,,,,,,,,,,,,,,,,,,,,,,,,,,,,,,,,,,
RSIADM04,1.0,1.0,1.0,2.0,30.0,2.0,5.0,4.0,11.0,2.0,1.0,1.0,2.0,,1.0,2.0,1.0,,1.0,,,,,,,,,,,,,,,,,,,,,,,,,,,,,,,,,,,,,,,,,,,,,,,,,,,,,,,,,,,,,,,,,,,,
RSIC01SA,7.0,1.0,6.0,2.0,23.0,1.0,5.0,1.0,11.0,6.0,1.0,0.0,1.0,1.0,1.0,0.0,1.0,4.0,4.0,,,10.0,3.0,5.0,6.0,,,,7.0,2.0,5.0,3.0,,,8.0,4.0,6.0,,,6.0,2.0,7.0,,,6.0,2.0,3.0,,4.0,1.0,,,,,,,,,,,,,,,,,,,,,,,,,4.0,4.0,1.0,0.0,4.0,,4.0,3.0,1.0,4.0,3.0,1.0,2.0
RSIC02SA,,1.0,5.0,2.0,36.0,1.0,6.0,5.0,1.0,4.0,1.0,0.0,1.0,2.0,3.0,0.0,1.0,4.0,6.0,,13.0,10.0,3.0,4.0,,,,14.0,8.0,3.0,5.0,11.0,,,7.0,3.0,4.0,,,6.0,3.0,7.0,,,7.0,5.0,,,,,,,,,,,,,,,,,,,,,,,,,,,,,4.0,4.0,1.0,0.0,4.0,11.0,4.0,4.0,1.0,4.0,4.0,0.0,1.0
RSIC03SA,7.0,1.0,4.0,2.0,39.0,4.0,4.0,3.0,3.0,5.0,1.0,1.0,2.0,3.0,3.0,0.0,1.0,5.0,6.0,,3.0,10.0,1.0,7.0,,,,,7.0,2.0,7.0,,,,5.0,2.0,3.0,,,6.0,1.0,,,,,,,,,,,,,,,,,,,,,,,,,,,,,,,,,,4.0,7.0,1.0,4.0,7.0,,4.0,4.0,3.0,3.0,3.0,0.0,1.0
IC06SARA,,1.0,5.0,1.0,21.0,1.0,5.0,1.0,1.0,5.0,5.0,0.0,1.0,4.0,5.0,0.0,1.0,4.0,4.0,,12.0,7.0,3.0,7.0,,,,12.0,6.0,3.0,7.0,12.0,,,5.0,2.0,7.0,,12.0,3.0,1.0,7.0,,,2.0,0.0,,,,,,,,,,,,,,,,,,,,,,,,,,,,,4.0,4.0,1.0,1.0,4.0,11.0,4.0,4.0,2.0,4.0,3.0,0.0,1.0
RSIC04SA,,1.0,2.0,2.0,44.0,4.0,5.0,31.0,11.0,6.0,1.0,0.0,0.0,2.0,5.0,0.0,,3.0,4.0,11.0,15.0,7.0,4.0,7.0,,,,16.0,6.0,3.0,,,,,,,,,,,,,,,,,,,,,,,,,,,,,,,,,,,,,,,,,,,,,,,,,,,,,,,,,3.0
RSIC05SA,7.0,1.0,2.0,2.0,22.0,1.0,5.0,3.0,10.0,9.0,1.0,0.0,3.0,5.0,3.0,3.0,2.0,6.0,7.0,6.0,3.0,10.0,5.0,7.0,3.0,,,,7.0,4.0,,,,,,,,,,,,,,,,,,,,,,,,,,,,,,,,,,,,,,,,,,,,,,,,,,,,,,,,,
IC011MF,7.0,1.0,6.0,1.0,44.0,1.0,7.0,1.0,1.0,9.0,1.0,0.0,0.0,6.0,3.0,0.0,,4.0,4.0,7.0,,7.0,4.0,7.0,,,,12.0,5.0,4.0,7.0,12.0,,,7.0,6.0,7.0,,12.0,7.0,5.0,7.0,,,8.0,3.0,12.0,,7.0,3.0,,,,,,,,,,,,,,,,,,,,,,,,,,,,,,,,,,,,,
RSIC06SA,5.0,1.0,9.0,2.0,36.0,2.0,5.0,3.0,1.0,5.0,5.0,0.0,0.0,4.0,3.0,0.0,,4.0,7.0,6.0,,8.0,4.0,4.0,7.0,,,,7.0,5.0,7.0,12.0,,,7.0,4.0,7.0,,,3.0,2.0,7.0,,,2.0,1.0,5.0,,10.0,5.0,7.0,,5.0,1.0,7.0,12.0,2.0,1.0,6.0,12.0,2.0,1.0,,,,,,,,,,,,,4.0,4.0,1.0,0.0,9.0,12.0,4.0,4.0,1.0,4.0,4.0,0.0,1.0
RSIC07SA,5.0,1.0,3.0,2.0,46.0,2.0,5.0,24.0,2.0,6.0,2.0,0.0,0.0,7.0,5.0,0.0,,3.0,7.0,,,6.0,3.0,5.0,,,,,3.0,0.0,7.0,,,,4.0,1.0,,,,,,,,,,,,,,,,,,,,,,,,,,,,,,,,,,,,,,,4.0,5.0,1.0,0.0,4.0,0.0,4.0,4.0,4.0,4.0,4.0,0.0,1.0
RSIC08SA,8.0,0.0,1.0,1.0,30.0,1.0,5.0,6.0,1.0,9.0,2.0,1.0,0.0,8.0,5.0,0.0,,2.0,7.0,,,4.0,3.0,,,,,,,,,,,,,,,,,,,,,,,,,,,,,,,,,,,,,,,,,,,,,,,,,,,,,,,,,,,,,,,,
RSIC09SA,8.0,1.0,3.0,2.0,37.0,1.0,4.0,1.0,10.0,9.0,5.0,0.0,3.0,4.0,3.0,3.0,1.0,6.0,2.0,4.0,3.0,10.0,8.0,17.0,,,,,8.0,7.0,7.0,,,,8.0,7.0,,,,,,,,,,,,,,,,,,,,,,,,,,,,,,,,,,,,,,,,,,,,,,2.0,4.0,1.0,2.0,0.0,4.0
05ICMF,,0.0,4.0,2.0,33.0,6.0,5.0,20.0,1.0,5.0,3.0,1.0,0.0,2.0,5.0,0.0,,4.0,4.0,,,10.0,2.0,7.0,,,,,6.0,3.0,7.0,,,,4.0,2.0,7.0,,,3.0,1.0,,,,,,,,,,,,,,,,,,,,,,,,,,,,,,,,,,,,,,,,,,,,,,
RSIC10SA,4.0,0.0,1.0,2.0,35.0,3.0,7.0,1.0,1.0,6.0,1.0,0.0,0.0,9.0,5.0,0.0,,2.0,7.0,,18.0,7.0,4.0,,,,,,,,,,,,,,,,,,,,,,,,,,,,,,,,,,,,,,,,,,,,,,,,,,,,,,,,,,,,,,,,
RSIC11SA,5.0,1.0,8.0,2.0,39.0,4.0,5.0,6.0,10.0,7.0,1.0,1.0,0.0,2.0,5.0,0.0,,3.0,7.0,,,10.0,4.0,5.0,,,,,6.0,4.0,7.0,12.0,,,7.0,5.0,7.0,,12.0,7.0,4.0,7.0,,,8.0,5.0,6.0,,10.0,5.0,7.0,12.0,10.0,7.0,7.0,12.0,8.0,,,,,,,,,,,,,,,,,,4.0,7.0,1.0,0.0,6.0,25.0,4.0,3.0,2.0,3.0,3.0,2.0,3.0
RSIC12SA,5.0,1.0,3.0,1.0,36.0,2.0,5.0,32.0,1.0,3.0,1.0,1.0,0.0,6.0,5.0,0.0,,3.0,7.0,,,3.0,3.0,7.0,,,,,3.0,2.0,7.0,,,,2.0,1.0,,,,,,,,,,,,,,,,,,,,,,,,,,,,,,,,,,,,,,,4.0,4.0,1.0,0.0,4.0,0.0,4.0,4.0,0.0,4.0,4.0,0.0,1.0
RSIC13SA,7.0,1.0,12.0,2.0,31.0,1.0,6.0,1.0,1.0,4.0,1.0,1.0,1.0,6.0,3.0,0.0,,4.0,4.0,7.0,,10.0,6.0,4.0,6.0,,,20.0,9.0,5.0,7.0,20.0,,,7.0,4.0,7.0,,,6.0,3.0,7.0,,,8.0,5.0,19.0,,9.0,6.0,6.0,12.0,9.0,6.0,7.0,12.0,9.0,5.0,7.0,12.0,9.0,5.0,6.0,12.0,7.0,9.0,7.0,12.0,7.0,4.0,7.0,12.0,8.0,5.0,4.0,7.0,1.0,1.0,4.0,21.0,4.0,4.0,4.0,4.0,4.0,3.0,2.0
RSIC14SA,6.0,1.0,1.0,1.0,32.0,2.0,5.0,18.0,11.0,3.0,1.0,0.0,0.0,9.0,5.0,0.0,,2.0,6.0,7.0,,6.0,3.0,,,,,,,,,,,,,,,,,,,,,,,,,,,,,,,,,,,,,,,,,,,,,,,,,,,,,,,,,,,,,,,,
RSIC15SA,8.0,1.0,1.0,2.0,30.0,2.0,6.0,18.0,3.0,4.0,1.0,1.0,1.0,7.0,3.0,4.0,1.0,6.0,6.0,7.0,,10.0,8.0,,,,,,,,,,,,,,,,,,,,,,,,,,,,,,,,,,,,,,,,,,,,,,,,,,,,,,,,,,,,,,,,
RSIC16SA,7.0,1.0,6.0,2.0,42.0,2.0,7.0,20.0,1.0,3.0,5.0,1.0,0.0,4.0,3.0,0.0,,4.0,7.0,5.0,,6.0,1.0,6.0,7.0,,,,3.0,1.0,6.0,,,,7.0,5.0,6.0,,19.0,6.0,4.0,6.0,,,3.0,1.0,6.0,,2.0,0.0,15.0,12.0,,,7.0,6.0,,,7.0,,,,,,,,,,,,,,,,4.0,8.0,1.0,1.0,10.0,8.0,4.0,4.0,4.0,4.0,4.0,3.0,1.0
17RS-SIM,7.0,1.0,9.0,2.0,35.0,3.0,5.0,31.0,10.0,5.0,4.0,1.0,2.0,4.0,3.0,0.0,1.0,5.0,4.0,6.0,22.0,8.0,3.0,19.0,6.0,23.0,3.0,12.0,6.0,3.0,5.0,17.0,,3.0,5.0,3.0,9.0,,4.0,8.0,4.0,7.0,,,3.0,1.0,7.0,,5.0,2.0,,,8.0,5.0,,,8.0,6.0,,,4.0,1.0,,,,,,,,,,,,,,,,,,,,,,,,,
18ICSIM,8.0,1.0,6.0,2.0,39.0,2.0,8.0,28.0,10.0,6.0,2.0,0.0,0.0,2.0,3.0,0.0,,4.0,6.0,7.0,12.0,8.0,3.0,7.0,,,,12.0,5.0,1.0,7.0,12.0,,,4.0,2.0,15.0,,,5.0,2.0,15.0,,,3.0,1.0,24.0,,3.0,0.0,,,,,,,,,,,,,,,,,,,,,,,,,4.0,5.0,1.0,2.0,25.0,25.0,4.0,4.0,1.0,4.0,3.0,0.0,1.0
19ICSIM,1.0,1.0,3.0,2.0,48.0,2.0,5.0,1.0,1.0,7.0,1.0,0.0,0.0,6.0,1.0,2.0,,4.0,7.0,,12.0,,,7.0,,,,12.0,8.0,6.0,7.0,,,,4.0,0.0,,,,,,,,,,,,,,,,,,,,,,,,,,,,,,,,,,,,,,,4.0,7.0,1.0,2.0,25.0,0.0,4.0,3.0,2.0,4.0,4.0,0.0,1.0
20ICSIM,5.0,1.0,3.0,2.0,28.0,3.0,7.0,1.0,1.0,4.0,1.0,1.0,0.0,19.0,3.0,2.0,,4.0,7.0,,12.0,3.0,,7.0,,,,12.0,4.0,,6.0,19.0,,,3.0,,,,,,,,,,,,,,,,,,,,,,,,,,,,,,,,,,,,,,,,,,,,,,,,,,,,
22ICSIM,5.0,1.0,6.0,1.0,43.0,3.0,7.0,1.0,1.0,9.0,2.0,0.0,0.0,10.0,3.0,0.0,2.0,4.0,7.0,6.0,12.0,8.0,5.0,7.0,6.0,4.0,,,5.0,3.0,7.0,12.0,,,4.0,2.0,2.0,,4.0,10.0,4.0,7.0,5.0,12.0,2.0,3.0,7.0,12.0,2.0,1.0,,,,,,,,,,,,,,,,,,,,,,,,,4.0,12.0,1.0,1.0,4.0,25.0,4.0,4.0,3.0,4.0,4.0,3.0,1.0
24ICSIM,5.0,1.0,3.0,2.0,32.0,1.0,4.0,1.0,1.0,9.0,1.0,0.0,0.0,3.0,3.0,0.0,,4.0,7.0,,12.0,9.0,5.0,7.0,26.0,,,12.0,7.0,4.0,7.0,12.0,,,4.0,2.0,,,,,,,,,,,,,,,,,,,,,,,,,,,,,,,,,,,,,,,4.0,7.0,1.0,0.0,4.0,0.0,4.0,4.0,4.0,3.0,3.0,0.0,1.0
25ICSIM,1.0,1.0,5.0,2.0,45.0,1.0,5.0,3.0,1.0,6.0,1.0,0.0,2.0,6.0,1.0,5.0,1.0,5.0,7.0,,,9.0,3.0,7.0,,,,,5.0,2.0,7.0,,,,3.0,2.0,7.0,,6.0,6.0,2.0,7.0,6.0,,3.0,2.0,,,,,,,,,,,,,,,,,,,,,,,,,,,,,4.0,7.0,1.0,0.0,25.0,0.0,4.0,4.0,3.0,4.0,3.0,0.0,2.0
26ICSIM,7.0,1.0,1.0,1.0,57.0,2.0,5.0,1.0,11.0,6.0,1.0,0.0,0.0,11.0,6.0,6.0,,3.0,27.0,,,,,,,,,,,,,,,,,,,,,,,,,,,,,,,,,,,,,,,,,,,,,,,,,,,,,,,,,,,,,,,,,,,,
27ICSIM,6.0,1.0,1.0,2.0,37.0,5.0,4.0,1.0,1.0,5.0,1.0,1.0,0.0,2.0,3.0,6.0,,4.0,7.0,,,7.0,7.0,,,,,,,,,,,,,,,,,,,,,,,,,,,,,,,,,,,,,,,,,,,,,,,,,,,,,,,,,,,,,,,,4.0
28ICSIM,1.0,1.0,4.0,2.0,32.0,2.0,5.0,3.0,2.0,9.0,1.0,1.0,,2.0,3.0,0.0,,4.0,7.0,,12.0,10.0,2.0,28.0,29.0,,,12.0,2.0,1.0,7.0,28.0,,12.0,2.0,0.0,7.0,,12.0,0.0,0.0,,,,,,,,,,,,,,,,,,,,,,,,,,,,,,,,,,4.0,7.0,1.0,0.0,4.0,0.0,4.0,4.0,4.0,4.0,4.0,0.0,1.0
30ICSIM,7.0,1.0,1.0,2.0,60.0,1.0,5.0,24.0,1.0,9.0,2.0,0.0,0.0,10.0,5.0,0.0,,3.0,7.0,,,10.0,8.0,,,,,,,,,,,,,,,,,,,,,,,,,,,,,,,,,,,,,,,,,,,,,,,,,,,,,7.0,,,,,,,,,,,3.0
31ICSIM,8.0,1.0,7.0,1.0,45.0,2.0,6.0,1.0,5.0,4.0,5.0,1.0,,4.0,3.0,0.0,,4.0,7.0,6.0,12.0,8.0,6.0,7.0,,,,12.0,6.0,4.0,7.0,25.0,,19.0,2.0,1.0,7.0,,12.0,1.0,0.0,7.0,4.0,12.0,0.0,0.0,7.0,6.0,0.0,0.0,7.0,6.0,0.0,0.0,,,,,,,,,,,,,,,,,,,,,4.0,7.0,1.0,0.0,25.0,0.0,4.0,4.0,4.0,4.0,4.0,0.0,1.0
33ICSIM,7.0,1.0,5.0,1.0,38.0,1.0,5.0,18.0,5.0,3.0,1.0,0.0,,6.0,3.0,0.0,,4.0,6.0,19.0,12.0,7.0,3.0,7.0,,,,12.0,2.0,2.0,7.0,4.0,,12.0,0.0,0.0,7.0,,12.0,0.0,0.0,7.0,,12.0,0.0,0.0,,,,,,,,,,,,,,,,,,,,,,,,,,,,,4.0,25.0,1.0,0.0,25.0,0.0,4.0,4.0,3.0,4.0,4.0,0.0,1.0
34ICSIM,7.0,1.0,3.0,1.0,37.0,2.0,6.0,1.0,1.0,2.0,1.0,1.0,,12.0,3.0,0.0,,3.0,19.0,,,5.0,1.0,6.0,23.0,29.0,,,1.0,0.0,23.0,7.0,,29.0,0.0,0.0,,,,,,,,,,,,,,,,,,,,,,,,,,,,,,,,,,,,,,,4.0,6.0,1.0,0.0,25.0,0.0,4.0,4.0,4.0,4.0,4.0,0.0,1.0
35ICSIM,7.0,1.0,5.0,1.0,52.0,2.0,6.0,2.0,10.0,4.0,1.0,1.0,,2.0,7.0,2.0,,4.0,7.0,,,3.0,0.0,7.0,,,,12.0,0.0,0.0,7.0,4.0,11.0,12.0,6.0,3.0,6.0,,5.0,4.0,4.0,7.0,,30.0,4.0,2.0,,,,,,,,,,,,,,,,,,,,,,,,,,,,,4.0,0.0,1.0,4.0,11.0,11.0,3.0,4.0,3.0,4.0,4.0,0.0,2.0
36ICSIM,5.0,1.0,2.0,1.0,25.0,1.0,5.0,1.0,1.0,3.0,1.0,1.0,0.0,2.0,3.0,0.0,,4.0,7.0,,,6.0,4.0,7.0,,,,,4.0,3.0,,,,,,,,,,,,,,,,,,,,,,,,,,,,,,,,,,,,,,,,,,,,,4.0,7.0,1.0,0.0,7.0,0.0,4.0,4.0,4.0,4.0,4.0,3.0,1.0
37ICSIM,4.0,1.0,1.0,2.0,37.0,1.0,5.0,6.0,2.0,6.0,5.0,0.0,0.0,8.0,3.0,0.0,,3.0,7.0,,,5.0,4.0,,,,,,,,,,,,,,,,,,,,,,,,,,,,,,,,,,,,,,,,,,,,,,,,,,,,,,,,,,,,,,,,3.0
38ICSIM,7.0,1.0,2.0,2.0,41.0,2.0,5.0,6.0,2.0,3.0,5.0,1.0,0.0,4.0,3.0,0.0,,3.0,7.0,,,7.0,5.0,7.0,,,,,3.0,0.0,,,,,,,,,,,,,,,,,,,,,,,,,,,,,,,,,,,,,,,,,,,,,4.0,7.0,1.0,0.0,7.0,0.0,4.0,4.0,4.0,4.0,4.0,0.0,1.0
39ICSIM,4.0,1.0,5.0,2.0,29.0,2.0,7.0,15.0,10.0,3.0,5.0,1.0,,4.0,5.0,7.0,,5.0,7.0,6.0,12.0,8.0,2.0,7.0,6.0,19.0,11.0,12.0,3.0,0.0,7.0,6.0,19.0,12.0,7.0,4.0,7.0,19.0,6.0,1.0,0.0,6.0,5.0,12.0,0.0,0.0,,,,,,,,,,,,,,,,,,,,,,,,,,,,,4.0,0.0,1.0,0.0,4.0,11.0,4.0,4.0,4.0,4.0,4.0,0.0,2.0
40ICSIM,8.0,1.0,3.0,2.0,56.0,1.0,4.0,1.0,1.0,9.0,5.0,0.0,,4.0,3.0,0.0,,4.0,7.0,,,5.0,3.0,7.0,24.0,5.0,,,7.0,5.0,7.0,,,,3.0,1.0,,,,,9.0,,,,,,,,,,,,,,,,,,,,,,,,,,,,,,,,,,4.0,24.0,1.0,1.0,5.0,11.0,3.0,3.0,3.0,4.0,3.0,0.0,1.0
41ICSIM,7.0,1.0,2.0,1.0,39.0,1.0,6.0,1.0,3.0,4.0,5.0,1.0,,4.0,3.0,2.0,,4.0,7.0,6.0,,5.0,3.0,7.0,,,,12.0,1.0,0.0,,,,,,,,,,,,,,,,,,,,,,,,,,,,,,,,,,,,,,,,,,,,,,,,,,,,,,,,,1.0
42ICSIM,8.0,1.0,2.0,2.0,27.0,1.0,5.0,16.0,2.0,5.0,1.0,0.0,,12.0,3.0,0.0,,3.0,7.0,29.0,,3.0,1.0,7.0,6.0,23.0,,,2.0,1.0,,,,,,,,,,,,,,,,,,,,,,,,,,,,,,,,,,,,,,,,,,,,,4.0,7.0,1.0,0.0,7.0,0.0,4.0,4.0,4.0,4.0,4.0,0.0,1.0
44ICSIM,5.0,1.0,1.0,2.0,29.0,1.0,5.0,5.0,2.0,6.0,2.0,0.0,,9.0,5.0,8.0,,3.0,7.0,,,9.0,6.0,,,,,,,,,,,,,,,,,,,,,,,,,,,,,,,,,,,,,,,,,,,,,,,,,,,,,,,,,,,,,,,,3.0
45ICSIM,7.0,1.0,2.0,1.0,34.0,3.0,5.0,1.0,2.0,9.0,1.0,0.0,,3.0,8.0,0.0,,4.0,7.0,26.0,,8.0,6.0,7.0,,,,,5.0,2.0,,,,,,,,,,,,,,,,,,,,,,,,,,,,,,,,,,,,,,,,,,,,,,,,,,,,,,,,,1.0
47ICSIM,1.0,1.0,1.0,1.0,31.0,1.0,6.0,11.0,10.0,4.0,2.0,0.0,,13.0,6.0,1.0,,4.0,7.0,30.0,,6.0,2.0,,,,,,,,,,,,,,,,,,,,,,,,,,,,,,,,,,,,,,,,,,,,,,,,,,,,,,,,,,,,,,,,
48ICSIM,4.0,1.0,1.0,2.0,33.0,1.0,7.0,3.0,2.0,3.0,5.0,1.0,,14.0,3.0,9.0,,4.0,7.0,,,8.0,,,,,,,,,,,,,,,,,,,,,,,,,,,,,,,,,,,,,,,,,,,,,,,,,,,,,,,,,,,,,,,,,
IC33SIM,7.0,1.0,3.0,2.0,30.0,1.0,4.0,1.0,3.0,7.0,1.0,1.0,,15.0,3.0,2.0,,4.0,7.0,4.0,12.0,,,7.0,4.0,12.0,,,,,,,,,,,,,,,,,,,,,,,,,,,,,,,,,,,,,,,,,,,,,,,,,4.0,4.0,1.0,0.0,5.0,4.0,4.0,4.0,3.0,4.0,4.0,0.0,1.0
IC36SIM,3.0,1.0,2.0,1.0,34.0,3.0,4.0,1.0,1.0,9.0,1.0,1.0,1.0,16.0,3.0,6.0,1.0,4.0,7.0,,12.0,8.0,5.0,7.0,6.0,12.0,,,4.0,3.0,,,,,,,,,,,,,,,,,,,,,,,,,,,,,,,,,,,,,,,,,,,,,,,,,,,,,,,,,
